Target
Prostaglandin E2 receptor EP3 subtype
Ligand
BDBM85182
Substrate
Ki
82±n/a nM
Comments
PDSP_256
Citation
 Kiriyama, MUshikubi, FKobayashi, THirata, MSugimoto, YNarumiya, S Ligand binding specificities of the eight types and subtypes of the mouse prostanoid receptors expressed in Chinese hamster ovary cells. Br J Pharmacol 122:217-24 (1997)  
Target
Name:
Prostaglandin E2 receptor EP3 subtype
Synonyms:
PE2R3_MOUSE Prostaglandin E2 receptor EP3 isoform alpha Prostanoid EP3 receptor Ptgerep3
Type:
G-protein coupled receptor
Mol. Mass.:
40092.50
Organism:
Mus musculus (Mouse)
Description:
Residue:
365
  
Inhibitor
Name:
BDBM85182
Synonyms:
AH-13205 NSC_132836
Type:
Small organic molecule
Emp. Form.:
C24H36O4
Mol. Mass.:
388.5402
SMILES:
CCCCCC(O)c1ccc(cc1)C1CCC(=O)C1CCCCCCC(O)=O
: