Target
Prostaglandin E2 receptor EP3 subtype
Ligand
BDBM50008780
Substrate
Ki
100±n/a nM
Comments
PDSP_949
Citation
 Kiriyama, MUshikubi, FKobayashi, THirata, MSugimoto, YNarumiya, S Ligand binding specificities of the eight types and subtypes of the mouse prostanoid receptors expressed in Chinese hamster ovary cells. Br J Pharmacol 122:217-24 (1997)  
Target
Name:
Prostaglandin E2 receptor EP3 subtype
Synonyms:
PE2R3_MOUSE Prostaglandin E2 receptor EP3 isoform alpha Prostanoid EP3 receptor Ptgerep3
Type:
G-protein coupled receptor
Mol. Mass.:
40092.50
Organism:
Mus musculus (Mouse)
Description:
Residue:
365
  
Inhibitor
Name:
BDBM50008780
Synonyms:
7-{3-[3-Hydroxy-4-(4-iodo-phenoxy)-but-1-enyl]-7-oxa-bicyclo[2.2.1]hept-2-yl}-hept-5-enoic acid I-BOP
Type:
Small organic molecule
Emp. Form.:
C23H29IO5
Mol. Mass.:
512.3778
SMILES:
O[C@@H](COc1ccc(I)cc1)\C=C\[C@H]1C2CC[C@H](O2)[C@@H]1C\C=C/CCCC(O)=O
: