Target
Prostaglandin E2 receptor EP4 subtype
Ligand
BDBM85185
Substrate
Ki
43±n/a nM
Comments
PDSP_1463
Citation
 Kiriyama, MUshikubi, FKobayashi, THirata, MSugimoto, YNarumiya, S Ligand binding specificities of the eight types and subtypes of the mouse prostanoid receptors expressed in Chinese hamster ovary cells. Br J Pharmacol 122:217-24 (1997)  
Target
Name:
Prostaglandin E2 receptor EP4 subtype
Synonyms:
PE2R4_MOUSE Prostanoid EP4 receptor Ptgerep4
Type:
G-protein coupled receptor
Mol. Mass.:
56175.66
Organism:
Mus musculus (Mouse)
Description:
Residue:
513
  
Inhibitor
Name:
BDBM85185
Synonyms:
PGE2,16,16-DIMETHYL
Type:
Small organic molecule
Emp. Form.:
C22H36O5
Mol. Mass.:
380.5182
SMILES:
CCCCC(C)(C)C(O)C=CC1C(O)CC(=O)C1CC=CCCCC(O)=O
: