Target
Thromboxane-A synthase
Ligand
BDBM85177
Substrate
Ki
1300±n/a nM
Comments
PDSP_1159
Citation
 Kiriyama, MUshikubi, FKobayashi, THirata, MSugimoto, YNarumiya, S Ligand binding specificities of the eight types and subtypes of the mouse prostanoid receptors expressed in Chinese hamster ovary cells. Br J Pharmacol 122:217-24 (1997)  
Target
Name:
Thromboxane-A synthase
Synonyms:
Cyp5 THAS_MOUSE Thromboxane Alpha
Type:
Enzyme Catalytic Domain
Mol. Mass.:
60395.39
Organism:
MOUSE
Description:
Thromboxane Alpha 0 MOUSE::P36423
Residue:
533
  
Inhibitor
Name:
BDBM85177
Synonyms:
CAS_80558-61-8 NSC_119139
Type:
Small organic molecule
Emp. Form.:
C22H30O5
Mol. Mass.:
374.4706
SMILES:
OC(COc1ccccc1)C=CC1CCC(=O)C1CCCCCCC(O)=O
: