Target
Nicotinic acetylcholine receptor
Ligand
BDBM86708
Substrate
Ki
>10000±n/a nM
Comments
PDSP_1954
Citation
 Johansson, LSohn, DThorberg, SOJackson, DMKelder, DLarsson, LGRényi, LRoss, SBWallsten, CEriksson, HHu, PSJerning, EMohell, NWestlind-Danielsson, A The pharmacological characterization of a novel selective 5-hydroxytryptamine1A receptor antagonist, NAD-299. J Pharmacol Exp Ther 283:216-25 (1997) Target
Name:
Nicotinic acetylcholine receptor
Synonyms:
Nicotinic acetylcholine receptor | n-AChR
Type:
Enzyme Catalytic Domain
Mol. Mass.:
2478.99
Organism:
RAT
Description:
n-AChR 0 RAT::Q62594
Residue:
23
  
Inhibitor
Name:
BDBM86708
Synonyms:
CAS_146714-97-8 CHEMBL514874 NSC_104911 | WAY 100,635
Type:
Small organic molecule
Emp. Form.:
C25H34N4O2
Mol. Mass.:
422.5631
SMILES:
COc1ccccc1N1CCN(CCN(C(=O)C2CCCCC2)c2ccccn2)CC1
: