Target
5-hydroxytryptamine receptor 4
Ligand
BDBM50056404
Substrate
Ki
19.05±n/a nM
Comments
PDSP_400
Citation
 Claeysen, SFaye, PSebben, MLemaire, SBockaert, JDumuis, A Cloning and expression of human 5-HT4S receptors. Effect of receptor density on their coupling to adenylyl cyclase. Neuroreport 8:3189-96 (1997)  
Target
Name:
5-hydroxytryptamine receptor 4
Synonyms:
5-HT-4 5-HT4L 5-hydroxytryptamine receptor 4 Htr4 Serotonin 4 (5-HT4) receptor
Type:
Enzyme Catalytic Domain
Mol. Mass.:
46117.31
Organism:
RAT
Description:
5-HT4 HTR4 RAT::Q62758
Residue:
406
  
Inhibitor
Name:
BDBM50056404
Synonyms:
3-Isopropyl-2-oxo-2,3-dihydro-benzoimidazole-1-carboxylic acid (8-methyl-8-aza-bicyclo[3.2.1]oct-3-yl)-amide CHEMBL59834
Type:
Small organic molecule
Emp. Form.:
C19H26N4O2
Mol. Mass.:
342.4353
SMILES:
CC(C)n1c2ccccc2n(C(=O)NC2CC3CCC(C2)N3C)c1=O
: