Target
5-hydroxytryptamine receptor 1A
Ligand
BDBM10755
Substrate
Ki
0.12±n/a nM
Comments
PDSP_150
Citation
 Owens, MJMorgan, WNPlott, SJNemeroff, CB Neurotransmitter receptor and transporter binding profile of antidepressants and their metabolites. J Pharmacol Exp Ther 283:1305-22 (1997) Target
Name:
5-hydroxytryptamine receptor 1A
Synonyms:
5-HT-1A 5-HT1A 5-hydroxytryptamine receptor 1A (5HT1A) 5ht1a Htr1a Serotonin 1a (5-HT1a) receptor/Adrenergic receptor alpha-1 | Serotonin receptor 1A
Type:
G Protein-Coupled Receptor (GPCR)
Mol. Mass.:
46445.29
Organism:
Rattus norvegicus (rat)
Description:
Binding assays were performed using rat hippocampal membranes.
Residue:
422
  
Inhibitor
Name:
BDBM10755
Synonyms:
14C-5-hydroxy tryptamine creatinine disulfate 5-HT 5-hydroxy tryptamine creatinine disulfate Serotonin | [3H]-5-HT
Type:
Small organic molecule
Emp. Form.:
C10H12N2O
Mol. Mass.:
176.2151
SMILES:
NCCc1c[nH]c2ccc(O)cc12
: