Target
5-hydroxytryptamine receptor 1A
Ligand
BDBM85198
Substrate
Ki
56±n/a nM
Comments
PDSP_942
Citation
 Owens, MJMorgan, WNPlott, SJNemeroff, CB Neurotransmitter receptor and transporter binding profile of antidepressants and their metabolites. J Pharmacol Exp Ther 283:1305-22 (1997) Target
Name:
5-hydroxytryptamine receptor 1A
Synonyms:
5-HT-1A 5-HT1A 5-hydroxytryptamine receptor 1A (5HT1A) 5ht1a Htr1a Serotonin 1a (5-HT1a) receptor/Adrenergic receptor alpha-1 | Serotonin receptor 1A
Type:
G Protein-Coupled Receptor (GPCR)
Mol. Mass.:
46445.29
Organism:
Rattus norvegicus (rat)
Description:
Binding assays were performed using rat hippocampal membranes.
Residue:
422
  
Inhibitor
Name:
BDBM85198
Synonyms:
CAS_127096 NSC_127096
Type:
Small organic molecule
Emp. Form.:
C25H32ClN5O3
Mol. Mass.:
486.006
SMILES:
CC(O)c1nn(CCCN2CCN(CC2)c2ccc(Cl)cc2)c(=O)n1CCOc1ccccc1
: