Target
Galanin receptor type 3
Ligand
BDBM85200
Substrate
Ki
6.25±n/a nM
Comments
PDSP_857
Citation
 Wang, SHe, CHashemi, TBayne, M Cloning and expressional characterization of a novel galanin receptor. Identification of different pharmacophores within galanin for the three galanin receptor subtypes. J Biol Chem 272:31949-52 (1997)  
Target
Name:
Galanin receptor type 3
Synonyms:
GALR3_RAT Galanin receptor type 3 Galr3
Type:
Enzyme Catalytic Domain
Mol. Mass.:
40439.51
Organism:
RAT
Description:
Galanin R3 GALR3 RAT::O88626
Residue:
370
  
Inhibitor
Name:
BDBM85200
Synonyms:
Galanin (1-19), rat | Galanin rat
Type:
Small organic molecule
Emp. Form.:
C92H135N27O26
Mol. Mass.:
2035.2216
SMILES:
CCC(C)C(NC(=O)C(C)NC(=O)C(Cc1cnc[nH]1)NC(=O)C1CCCN1C(=O)CNC(=O)C(CC(C)C)NC(=O)C(CC(C)C)NC(=O)C(Cc1ccc(O)cc1)NC(=O)CNC(=O)C(C)NC(=O)C(CO)NC(=O)C(CC(N)=O)NC(=O)C(CC(C)C)NC(=O)C(NC(=O)C(Cc1c[nH]c2ccccc12)NC(=O)CN)C(C)O)C(=O)NC(CC(O)=O)C(=O)NC(CC(N)=O)C(=O)NC(Cc1cnc[nH]1)C(N)=O
: