Target
Neuronal acetylcholine receptor subunit alpha-4
Ligand
BDBM50062639
Substrate
Ki
0.03±n/a nM
Comments
PDSP_223
Citation
 Bannon, AWDecker, MWHolladay, MWCurzon, PDonnelly-Roberts, DPuttfarcken, PSBitner, RSDiaz, ADickenson, AHPorsolt, RDWilliams, MArneric, SP Broad-spectrum, non-opioid analgesic activity by selective modulation of neuronal nicotinic acetylcholine receptors. Science 279:77-81 (1998)  
Target
Name:
Neuronal acetylcholine receptor subunit alpha-4
Synonyms:
ACHA4_RAT Cholinergic, Nicotinic Alpha4Beta2 Chrna4 Neuronal acetylcholine receptor (alpha4beta2 nAChR) Neuronal acetylcholine receptor subunit alpha 4 beta 2 | Neuronal acetylcholine receptor subunit alpha-4
Type:
Enzyme
Mol. Mass.:
70196.44
Organism:
Rattus norvegicus (Rat)
Description:
P09483
Residue:
630
  
Inhibitor
Name:
BDBM50062639
Synonyms:
5-((S)-1-Azetidin-2-ylmethoxy)-2-chloro-pyridine ABT-594 | CHEMBL439766
Type:
Small organic molecule
Emp. Form.:
C9H11ClN2O
Mol. Mass.:
198.649
SMILES:
Clc1ccc(OC[C@@H]2CCN2)cn1
: