Target
5-hydroxytryptamine receptor 7
Ligand
BDBM50001786
Substrate
Ki
28±n/a nM
Comments
PDSP_1709
Citation
 Arnt, JSkarsfeldt, T Do novel antipsychotics have similar pharmacological characteristics? A review of the evidence. Neuropsychopharmacology 18:63-101 (1998)  
Target
Name:
5-hydroxytryptamine receptor 7
Synonyms:
5-HT-7 5-HT7 5-hydroxytryptamine receptor 7 (5HT7) 5HT7R_MOUSE Serotonin 7 (5-HT7) receptor
Type:
Enzyme
Mol. Mass.:
49932.71
Organism:
Mus musculus (Mouse)
Description:
P32304
Residue:
448
  
Inhibitor
Name:
BDBM50001786
Synonyms:
1-(2-{4-[5-chloro-1-(4-fluorophenyl)-1H-indol-3-yl]piperidin-1-yl}ethyl)imidazolidin-2-one CHEMBL12713 | Sertindole
Type:
Small organic molecule
Emp. Form.:
C24H26ClFN4O
Mol. Mass.:
440.941
SMILES:
Fc1ccc(cc1)-n1cc(C2CCN(CCN3CCNC3=O)CC2)c2cc(Cl)ccc12
: