Target
Adenosine receptor A2a
Ligand
BDBM50041905
Substrate
Ki
0.9±n/a nM
Comments
PDSP_2622
Citation
 Camaioni, EDi Francesco, EVittori, SVolpini, RCristalli, G Adenosine receptor agonists: synthesis and biological evaluation of the diastereoisomers of 2-(3-hydroxy-3-phenyl-1-propyn-1-yl)NECA. Bioorg Med Chem 5:2267-75 (1997)  
Target
Name:
Adenosine receptor A2a
Synonyms:
AA2AR_RAT Adenosine A2 receptor Adenosine Receptors A2a (A2a) Adenosine receptors A2a Rat striatal adenosine A2a receptor
Type:
G Protein-Coupled Receptor (GPCR)
Mol. Mass.:
45015.65
Organism:
Rattus norvegicus (rat)
Description:
Rat A2A receptors expressed in CHO cells.
Residue:
410
  
Inhibitor
Name:
BDBM50041905
Synonyms:
5-[6-Amino-2-(3-hydroxy-3-phenyl-prop-1-ynyl)-purin-9-yl]-3,4-dihydroxy-tetrahydro-furan-2-carboxylic acid ethylamide 6, PHPNECA | R,S-PHPNECA
Type:
Small organic molecule
Emp. Form.:
C21H22N6O5
Mol. Mass.:
438.4366
SMILES:
CCNC(=O)C1OC(C(O)C1O)n1cnc2c(N)nc(nc12)C#CC(O)c1ccccc1
: