Target
Glutamate receptor 3
Ligand
BDBM50008692
Substrate
Ki
>10000±n/a nM
Comments
PDSP_289
Citation
 Varney, MARao, SPJachec, CDeal, CHess, SDDaggett, LPLin, FJohnson, ECVeliçelebi, G Pharmacological characterization of the human ionotropic glutamate receptor subtype GluR3 stably expressed in mammalian cells. J Pharmacol Exp Ther 285:358-70 (1998) Target
Name:
Glutamate receptor 3
Synonyms:
AMPA-selective glutamate receptor 3 GLURC GRIA3_HUMAN GluR-C Glutamate receptor 3 Glutamate receptor ionotropic, AMPA 3
Type:
PROTEIN
Mol. Mass.:
101172.14
Organism:
Homo sapiens (Human)
Description:
ChEMBL_468627
Residue:
894
  
Inhibitor
Name:
BDBM50008692
Synonyms:
2-Amino-3-(3-carboxymethoxy-5-methyl-isoxazol-4-yl)-propionic acid(AMOA) | AMOA
Type:
Small organic molecule
Emp. Form.:
C9H11N2O6
Mol. Mass.:
243.194
SMILES:
Cc1onc(OCC([O-])=O)c1CC([NH3+])C([O-])=O
: