Target
Neuronal acetylcholine receptor subunit alpha-4
Ligand
BDBM85224
Substrate
Ki
3.8±n/a nM
Comments
PDSP_1165
Citation
 Whiteaker, PSharples, CGWonnacott, S Agonist-induced up-regulation of alpha4beta2 nicotinic acetylcholine receptors in M10 cells: pharmacological and spatial definition. Mol Pharmacol 53:950-62 (1998) Target
Name:
Neuronal acetylcholine receptor subunit alpha-4
Synonyms:
ACHA4_HUMAN CHRNA4 protein Neuronal acetylcholine receptor protein alpha-4 subunit Nicotinic acetylcholine receptor alpha4/beta2/alpha5
Type:
Mol. Mass.:
69963.49
Organism:
Homo sapiens (Human)
Description:
NACHRA4
Residue:
627
  
Inhibitor
Name:
BDBM85224
Synonyms:
CAS_1918-18-9 SWEP
Type:
Small organic molecule
Emp. Form.:
C8H7Cl2NO2
Mol. Mass.:
220.053
SMILES:
COC(=O)Nc1ccc(Cl)c(Cl)c1
: