Target
Protein kinase C eta type
Ligand
BDBM3152
Substrate
Histone type HL
Meas. Tech.
PKC assay
pH
7.5±n/a
Temperature
303.15±n/a K
IC50
4±n/a nM
Citation
 Crane, HMMenaldino, DSJagdmann, GEDarges, JWBuben, JA Increasing the cellular PKC inhibitory activity of balanol: a study of ester analogs. Bioorg Med Chem Lett 5:2133-8 (1995)    Article 
Target
Name:
Protein kinase C eta type
Synonyms:
KPCL_HUMAN PKCL PRKCL Protein kinase C, PKC; classical/novel | nPKC-eta
Type:
Enzyme
Mol. Mass.:
77844.26
Organism:
Homo sapiens (Human)
Description:
The recombinant human PKC enzymes were produced using a baculovirus expression system in SF9 cells
Residue:
683
  
Inhibitor
Name:
BDBM3152
Synonyms:
2-{[2,6-dihydroxy-4-({[(3R,4R)-4-[(4-hydroxybenzene)amido]pyrrolidin-3-yl]oxy}carbonyl)phenyl]carbonyl}-3-hydroxybenzoic acid CHEMBL59828
Type:
Small organic molecule
Emp. Form.:
C26H22N2O10
Mol. Mass.:
522.4603
SMILES:
OC(=O)c1cccc(O)c1C(=O)c1c(O)cc(cc1O)C(=O)O[C@@H]1CNC[C@H]1NC(=O)c1ccc(O)cc1
:
Substrate
Name:
Histone type HL
Synonyms:
Type:
Peptide
Mol. Mass.:
358.43
Organism:
Description:
unfractionated histone (Worthington) 30 uM [gamma-32P]ATP as co-substrate.
Residue:
3
NA