Target
Alpha-2A adrenergic receptor
Ligand
BDBM50016897
Substrate
Ki
40.74±n/a nM
Comments
PDSP_544
Citation
 Jasper, JRLesnick, JDChang, LKYamanishi, SSChang, TKHsu, SADaunt, DABonhaus, DWEglen, RM Ligand efficacy and potency at recombinant alpha2 adrenergic receptors: agonist-mediated [35S]GTPgammaS binding. Biochem Pharmacol 55:1035-43 (1998)  
Target
Name:
Alpha-2A adrenergic receptor
Synonyms:
ADRA2A adrenergic Alpha2A
Type:
Enzyme Catalytic Domain
Mol. Mass.:
48888.08
Organism:
MOUSE
Description:
adrenergic Alpha2A ADRA2A MOUSE::Q01338
Residue:
450
  
Inhibitor
Name:
BDBM50016897
Synonyms:
2-(2,6-dichloroanilino)-1,3-diazacyclopentene-(2) CLONIDINE clonidine (amino form)
Type:
Small organic molecule
Emp. Form.:
C9H9Cl2N3
Mol. Mass.:
230.094
SMILES:
Clc1cccc(Cl)c1\[#7]=[#6]-1\[#7]-[#6]-[#6]-[#7]-1
: