Target
Alpha-2A adrenergic receptor
Ligand
BDBM50241196
Substrate
Ki
13.18±n/a nM
Comments
PDSP_3304
Citation
 Jasper, JRLesnick, JDChang, LKYamanishi, SSChang, TKHsu, SADaunt, DABonhaus, DWEglen, RM Ligand efficacy and potency at recombinant alpha2 adrenergic receptors: agonist-mediated [35S]GTPgammaS binding. Biochem Pharmacol 55:1035-43 (1998)  
Target
Name:
Alpha-2A adrenergic receptor
Synonyms:
ADA2A_HUMAN ADRA2R Adrenergic alpha2A Alpha-2 adrenergic receptor subtype C10 Alpha-2A adrenoreceptor alpha-2A adrenergic receptor [Homo sapiens]
Type:
Enzyme
Mol. Mass.:
48979.91
Organism:
Homo sapiens (Human)
Description:
P08913
Residue:
450
  
Inhibitor
Name:
BDBM50241196
Synonyms:
(R)-5-(1-(2,3-dimethylphenyl)ethyl)-1H-imidazole CHEMBL397901 | Dexmedetomidine
Type:
Small organic molecule
Emp. Form.:
C13H16N2
Mol. Mass.:
200.2795
SMILES:
C[C@@H](c1cnc[nH]1)c1cccc(C)c1C
: