Target
Alpha-2A adrenergic receptor
Ligand
BDBM55436
Substrate
Ki
229.09±n/a nM
Comments
PDSP_1893
Citation
 Jasper, JRLesnick, JDChang, LKYamanishi, SSChang, TKHsu, SADaunt, DABonhaus, DWEglen, RM Ligand efficacy and potency at recombinant alpha2 adrenergic receptors: agonist-mediated [35S]GTPgammaS binding. Biochem Pharmacol 55:1035-43 (1998)  
Target
Name:
Alpha-2A adrenergic receptor
Synonyms:
ADA2A_HUMAN ADRA2R Adrenergic alpha2A Alpha-2 adrenergic receptor subtype C10 Alpha-2A adrenoreceptor alpha-2A adrenergic receptor [Homo sapiens]
Type:
Enzyme
Mol. Mass.:
48979.91
Organism:
Homo sapiens (Human)
Description:
P08913
Residue:
450
  
Inhibitor
Name:
BDBM55436
Synonyms:
2-(phenylmethyl)-4,5-dihydro-1H-imidazole;hydrochloride 2-benzyl-2-imidazoline;hydrochloride MLS000559484 Tolazoline | cid_6048
Type:
Small organic molecule
Emp. Form.:
C10H12N2
Mol. Mass.:
160.2157
SMILES:
C(C1=NCCN1)c1ccccc1
: