Target
Alpha-2B adrenergic receptor
Ligand
BDBM85233
Substrate
Ki
125.89±n/a nM
Comments
PDSP_5982
Citation
 Jasper, JRLesnick, JDChang, LKYamanishi, SSChang, TKHsu, SADaunt, DABonhaus, DWEglen, RM Ligand efficacy and potency at recombinant alpha2 adrenergic receptors: agonist-mediated [35S]GTPgammaS binding. Biochem Pharmacol 55:1035-43 (1998)  
Target
Name:
Alpha-2B adrenergic receptor
Synonyms:
ADA2B_HUMAN ADRA2L1 Adrenergic alpha2B Adrenergic receptor alpha Alpha-2 adrenergic receptor subtype C2 Alpha-2B adrenoreceptor | Alpha-2BAR
Type:
Enzyme
Mol. Mass.:
49964.20
Organism:
Homo sapiens (Human)
Description:
P18089
Residue:
450
  
Inhibitor
Name:
BDBM85233
Synonyms:
CAS_81447-78-1 | Levlofexidine
Type:
Small organic molecule
Emp. Form.:
C11H12Cl2N2O
Mol. Mass.:
259.132
SMILES:
C[C@@H](Oc1c(Cl)cccc1Cl)C1=NCCN1
: