Target
Alpha-2C adrenergic receptor
Ligand
BDBM85231
Substrate
Ki
>10000±n/a nM
Comments
PDSP_5984
Citation
 Jasper, JRLesnick, JDChang, LKYamanishi, SSChang, TKHsu, SADaunt, DABonhaus, DWEglen, RM Ligand efficacy and potency at recombinant alpha2 adrenergic receptors: agonist-mediated [35S]GTPgammaS binding. Biochem Pharmacol 55:1035-43 (1998)  
Target
Name:
Alpha-2C adrenergic receptor
Synonyms:
ADA2C_HUMAN ADRA2L2 Adrenergic alpha2C Adrenergic receptor alpha Alpha-2 adrenergic receptor subtype C4 Alpha-2C adrenoreceptor | adrenergic, alpha-2C-, receptor [Homo sapiens]
Type:
Enzyme
Mol. Mass.:
49552.32
Organism:
Homo sapiens (Human)
Description:
P18825
Residue:
462
  
Inhibitor
Name:
BDBM85231
Synonyms:
Alinidine | CAS_33178-86-8
Type:
Small organic molecule
Emp. Form.:
C12H13Cl2N3
Mol. Mass.:
270.158
SMILES:
Clc1cccc(Cl)c1N(CC=C)C1=NCCN1
: