Target
Alpha-2C adrenergic receptor
Ligand
BDBM50262235
Substrate
Ki
4677.35±n/a nM
Comments
PDSP_5980
Citation
 Jasper, JRLesnick, JDChang, LKYamanishi, SSChang, TKHsu, SADaunt, DABonhaus, DWEglen, RM Ligand efficacy and potency at recombinant alpha2 adrenergic receptors: agonist-mediated [35S]GTPgammaS binding. Biochem Pharmacol 55:1035-43 (1998)  
Target
Name:
Alpha-2C adrenergic receptor
Synonyms:
ADA2C_HUMAN ADRA2L2 Adrenergic alpha2C Adrenergic receptor alpha Alpha-2 adrenergic receptor subtype C4 Alpha-2C adrenoreceptor | adrenergic, alpha-2C-, receptor [Homo sapiens]
Type:
Enzyme
Mol. Mass.:
49552.32
Organism:
Homo sapiens (Human)
Description:
P18825
Residue:
462
  
Inhibitor
Name:
BDBM50262235
Synonyms:
rilmenidine
Type:
Small organic molecule
Emp. Form.:
C10H17N2O
Mol. Mass.:
181.2542
SMILES:
C1CC1C(NC1=[NH+]CCO1)C1CC1
: