Target
Melatonin receptor type 1A
Ligand
BDBM85064
Substrate
Ki
0.33±n/a nM
Comments
PDSP_886
Citation
 Beresford, IJBrowning, CStarkey, SJBrown, JFoord, SMCoughlan, JNorth, PCDubocovich, MLHagan, RM GR196429: a nonindolic agonist at high-affinity melatonin receptors. J Pharmacol Exp Ther 285:1239-45 (1998) Target
Name:
Melatonin receptor type 1A
Synonyms:
MTNR1A Melatonin | Melatonin receptor type 1A
Type:
Enzyme Catalytic Domain
Mol. Mass.:
17908.30
Organism:
GUINEA PIG
Description:
Melatonin 0 GUINEA PIG::O02781
Residue:
154
  
Inhibitor
Name:
BDBM85064
Synonyms:
CAS_5311134 NSC_5311134
Type:
Small organic molecule
Emp. Form.:
C14H18N2O2
Mol. Mass.:
246.3049
SMILES:
CC(=O)NCCN1CCc2ccc3OCCc3c12
: