Target
Prostaglandin G/H synthase 1
Ligand
BDBM40128
Substrate
Ki
>10000±n/a nM
Comments
PDSP_4475
Citation
 Cryer, BFeldman, M Cyclooxygenase-1 and cyclooxygenase-2 selectivity of widely used nonsteroidal anti-inflammatory drugs. Am J Med 104:413-21 (1998)  
Target
Name:
Prostaglandin G/H synthase 1
Synonyms:
COX-1 Cyclooxygenase Cyclooxygenase-1 (COX-1) PTGS1 | Prostaglandin G/H synthase (cyclooxygenase)
Type:
Enzyme
Mol. Mass.:
68692.62
Organism:
Homo sapiens (Human)
Description:
P23219
Residue:
599
  
Inhibitor
Name:
BDBM40128
Synonyms:
MLS000069541 SMR000058835 | cid_4409
Type:
Small organic molecule
Emp. Form.:
C15H16O2
Mol. Mass.:
228.2863
SMILES:
COc1ccc2cc(CCC(C)=O)ccc2c1
: