Target
Aromatase [1-48]
Ligand
BDBM85249
Substrate
Meas. Tech.
Biological Assay
IC50
130±n/a nM
Citation
 Pouget, CYahiaoui, SFagnere, CHabrioux, GChulia, AJ Synthesis and biological evaluation of 4-imidazolylflavans as nonsteroidal aromatase inhibitors. Bioorg Chem 32:494-503 (2004)  
Target
Name:
Aromatase [1-48]
Synonyms:
ARO1 CP19A_HUMAN CYP19 | CYP19A1
Type:
Protein
Mol. Mass.:
5299.77
Organism:
Homo sapiens (Human)
Description:
Q16449
Residue:
48
  
Inhibitor
Name:
BDBM85249
Synonyms:
2,4-Trans-3'-hydroxy-4-imidazolyl-7-methoxyflavan, 3a
Type:
Small organic molecule
Emp. Form.:
C19H18N2O3
Mol. Mass.:
322.3578
SMILES:
COc1ccc2C(CC(Oc2c1)c1cccc(O)c1)n1ccnc1
: