Target
Aromatase [1-48]
Ligand
BDBM85253
Substrate
Meas. Tech.
Biological Assay
IC50
77±n/a nM
Citation
 Pouget, CYahiaoui, SFagnere, CHabrioux, GChulia, AJ Synthesis and biological evaluation of 4-imidazolylflavans as nonsteroidal aromatase inhibitors. Bioorg Chem 32:494-503 (2004)  
Target
Name:
Aromatase [1-48]
Synonyms:
ARO1 CP19A_HUMAN CYP19 | CYP19A1
Type:
Protein
Mol. Mass.:
5299.77
Organism:
Homo sapiens (Human)
Description:
Q16449
Residue:
48
  
Inhibitor
Name:
BDBM85253
Synonyms:
2,4-Trans-4',7-dihydroxy-4-imidazolyl-7-methoxyflavan, 3e
Type:
Small organic molecule
Emp. Form.:
C18H16N2O3
Mol. Mass.:
308.3312
SMILES:
Oc1ccc(cc1)C1CC(c2ccc(O)cc2O1)n1ccnc1
: