Target
Dihydroorotase
Ligand
BDBM85254
Substrate
Meas. Tech.
Inhibition Assay
pH
9±0
Ki
440000000±0 nM
Citation
 Li, YRaushel, FM Inhibitors designed for the active site of dihydroorotase. Bioorg Chem 33:470-83 (2005)  
Target
Name:
Dihydroorotase
Synonyms:
Dihydroorotase (DHO) pyrC
Type:
Enzyme
Mol. Mass.:
38823.92
Organism:
Escherichia coli
Description:
P05020
Residue:
348
  
Inhibitor
Name:
BDBM85254
Synonyms:
4,6-dioxo-piperidine-2-carboxylic acid, 3
Type:
Small organic molecule
Emp. Form.:
C6H6NO4
Mol. Mass.:
156.1167
SMILES:
[O-]C(=O)[C@@H]1CC(=O)CC(=O)N1
: