Target
Somatostatin receptor type 2
Ligand
BDBM82464
Substrate
Ki
0.27±n/a nM
Comments
PDSP_1591
Citation
 Siehler, SSeuwen, KHoyer, D [125I][Tyr3]octreotide labels human somatostatin sst2 and sst5 receptors. Eur J Pharmacol 348:311-20 (1998)  
Target
Name:
Somatostatin receptor type 2
Synonyms:
SOMATOSTATIN SST2 SS-2-R SS2R SSTR2 | Somatostatin receptor type 2 (SSTR2)
Type:
Enzyme
Mol. Mass.:
41344.94
Organism:
Homo sapiens (Human)
Description:
P30874
Residue:
369
  
Inhibitor
Name:
BDBM82464
Synonyms:
CAS_71306 RC 160 | Vapreotide
Type:
Small organic molecule
Emp. Form.:
C57H70N12O9S2
Mol. Mass.:
1131.371
SMILES:
CC(C)C1NC(=O)C(CCCCN)NC(=O)C(Cc2c[nH]c3ccccc23)NC(=O)C(Cc2ccc(O)cc2)NC(=O)C(CSSCC(NC1=O)C(=O)NC(Cc1c[nH]c2ccccc12)C(N)=O)NC(=O)C(N)Cc1ccccc1
: