Target
Alpha-1A adrenergic receptor
Ligand
BDBM50002338
Substrate
Ki
12.59±n/a nM
Comments
PDSP_1849
Citation
 Wikberg-Matsson, AWikberg, JEUhlén, S Characterization of alpha1-adrenoceptor subtypes in the pig. Eur J Pharmacol 347:301-9 (1998)  
Target
Name:
Alpha-1A adrenergic receptor
Synonyms:
ADA1A_CAVPO adrenergic Alpha1A
Type:
Enzyme Catalytic Domain
Mol. Mass.:
51603.72
Organism:
PIG
Description:
adrenergic Alpha1A ADRA1A PIG::Q9WU25
Residue:
466
  
Inhibitor
Name:
BDBM50002338
Synonyms:
(Thioridazine)10-[2-(1-Methyl-piperidin-2-yl)-ethyl]-2-methylsulfanyl-10H-phenothiazine 10-[2-(1-Methyl-piperidin-2-yl)-ethyl]-2-methylsulfanyl-10H-phenothiazine CHEMBL479 MELLARIL-S TP-21 | US9504692, Thioridazine
Type:
Small organic molecule
Emp. Form.:
C21H26N2S2
Mol. Mass.:
370.575
SMILES:
CSc1ccc2Sc3ccccc3N(CCC3CCCCN3C)c2c1
: