Target
D(1A) dopamine receptor
Ligand
BDBM50005247
Substrate
Ki
>10000±n/a nM
Comments
PDSP_1170
Citation
 Toll, LBerzetei-Gurske, IPPolgar, WEBrandt, SRAdapa, IDRodriguez, LSchwartz, RWHaggart, DO'Brien, AWhite, AKennedy, JMCraymer, KFarrington, LAuh, JS Standard binding and functional assays related to medications development division testing for potential cocaine and opiate narcotic treatment medications. NIDA Res Monogr 178:440-66 (1998) Target
Name:
D(1A) dopamine receptor
Synonyms:
DA D1 receptor DRD1 Dopamine D1 receptor Dopamine D1A
Type:
Enzyme
Mol. Mass.:
49303.43
Organism:
Homo sapiens (Human)
Description:
P21728
Residue:
446
  
Inhibitor
Name:
BDBM50005247
Synonyms:
(+/-)2-Benzo[1,3]dioxol-5-yl-1-methyl-ethylamine (R)-(-)-2-Benzo[1,3]dioxol-5-yl-1-methyl-ethylamine 2-Benzo[1,3]dioxol-5-yl-1-methyl-ethylamine 3,4-methylenedioxyamphetamine MDA MDA,R(-) methylenedioxyamphetamine
Type:
Small organic molecule
Emp. Form.:
C10H13NO2
Mol. Mass.:
179.2157
SMILES:
CC(N)Cc1ccc2OCOc2c1
: