Target
Kappa-type opioid receptor
Ligand
BDBM50000507
Substrate
Ki
>10000±n/a nM
Comments
PDSP_635
Citation
 Toll, LBerzetei-Gurske, IPPolgar, WEBrandt, SRAdapa, IDRodriguez, LSchwartz, RWHaggart, DO'Brien, AWhite, AKennedy, JMCraymer, KFarrington, LAuh, JS Standard binding and functional assays related to medications development division testing for potential cocaine and opiate narcotic treatment medications. NIDA Res Monogr 178:440-66 (1998) Target
Name:
Kappa-type opioid receptor
Synonyms:
Kappa Opioid Receptor OPRK1 Opiate Kappa 1 | mu/kappa opioid receptor
Type:
G Protein-Coupled Receptor (GPCR)
Mol. Mass.:
42744.99
Organism:
Cavia porcellus (domestic guinea pig)
Description:
P41144
Residue:
380
  
Inhibitor
Name:
BDBM50000507
Synonyms:
(R)-2-[(S)-2-Amino-3-(4-hydroxy-2,6-dimethyl-phenyl)-propionylamino]-5-guanidino-pentanoic acid [(S)-1-(2-carbamoyl-ethylcarbamoyl)-2-phenyl-ethyl]-amide (S)-5-((S)-1-((S)-1-(2-amino-2-oxoethylamino)-3-methyl-1-oxobutan-2-ylamino)-3-methyl-1-oxobutan-2-ylamino)-4-((S)-2-((R)-2-((S)-2-amino-3-(4-hydroxyphenyl)propanamido)propanamido)-3-phenylpropanamido)-5-oxopentanoic acid 4-(2-{2-[2-Amino-3-(4-hydroxy-phenyl)-propionylamino]-propionylamino}-3-phenyl-propionylamino)-4-{1-[1-(carbamoylmethyl-carbamoyl)-2-methyl-propylcarbamoyl]-2-methyl-propylcarbamoyl}-butyric acid (deltorphin B) DELTORPHIN-II Tyr-D-Ala-Phe-Glu-Val-Val-GlyNH2
Type:
Small organic molecule
Emp. Form.:
C38H54N8O10
Mol. Mass.:
782.883
SMILES:
CC(C)[C@H](NC(=O)[C@@H](NC(=O)[C@H](CCC(O)=O)NC(=O)[C@H](Cc1ccccc1)NC(=O)[C@@H](C)NC(=O)[C@@H](N)Cc1ccc(O)cc1)C(C)C)C(=O)NCC(N)=O
: