Target
Kappa-type opioid receptor
Ligand
BDBM82507
Substrate
Ki
728±n/a nM
Comments
PDSP_1
Citation
 Toll, LBerzetei-Gurske, IPPolgar, WEBrandt, SRAdapa, IDRodriguez, LSchwartz, RWHaggart, DO'Brien, AWhite, AKennedy, JMCraymer, KFarrington, LAuh, JS Standard binding and functional assays related to medications development division testing for potential cocaine and opiate narcotic treatment medications. NIDA Res Monogr 178:440-66 (1998) Target
Name:
Kappa-type opioid receptor
Synonyms:
Kappa Opioid Receptor OPRK1 Opiate Kappa 1 | mu/kappa opioid receptor
Type:
G Protein-Coupled Receptor (GPCR)
Mol. Mass.:
42744.99
Organism:
Cavia porcellus (domestic guinea pig)
Description:
P41144
Residue:
380
  
Inhibitor
Name:
BDBM82507
Synonyms:
(+/-)-Methadone METHADONE NSC_22266
Type:
Small organic molecule
Emp. Form.:
C21H27NO
Mol. Mass.:
309.4452
SMILES:
CCC(=O)C(CC(C)N(C)C)(c1ccccc1)c1ccccc1
: