Target
Mu-type opioid receptor
Ligand
BDBM50019056
Substrate
Ki
1.28±n/a nM
Comments
PDSP_1208
Citation
 Goldberg, IERossi, GCLetchworth, SRMathis, JPRyan-Moro, JLeventhal, LSu, WEmmel, DBolan, EAPasternak, GW Pharmacological characterization of endomorphin-1 and endomorphin-2 in mouse brain. J Pharmacol Exp Ther 286:1007-13 (1998) Target
Name:
Mu-type opioid receptor
Synonyms:
M-OR-1 Mor OPRM_MOUSE Oprm | Oprm1
Type:
Enzyme Catalytic Domain
Mol. Mass.:
44431.62
Organism:
MOUSE
Description:
OPIATE Mu OPRM1 MOUSE::P42866
Residue:
398
  
Inhibitor
Name:
BDBM50019056
Synonyms:
(S)-2-[(S)-2-(2-{2-[(S)-2-Amino-3-(4-hydroxy-phenyl)-propionylamino]-acetylamino}-acetylamino)-3-phenyl-propionylamino]-4-methylsulfanyl-butyric acid 2-[(S)-2-(2-{2-[(S)-2-Amino-3-(4-hydroxy-phenyl)-propionylamino]-acetylamino}-acetylamino)-1-oxo-3-phenyl-propylamino]-4-methylsulfanyl-butyric acid 2-[2-(2-{2-[2-Amino-3-(4-hydroxy-phenyl)-propionylamino]-acetylamino}-acetylamino)-3-phenyl-propionylamino]-4-methylsulfanyl-butyric acid H-Tyr-Gly-Gly-Phe-Met-OH [Met5]-enkephalin | met-enkephalin
Type:
Small organic molecule
Emp. Form.:
C27H35N5O7S
Mol. Mass.:
573.661
SMILES:
CSCC[C@H](NC(=O)[C@H](Cc1ccccc1)NC(=O)CNC(=O)CNC(=O)[C@@H](N)Cc1ccc(O)cc1)C(O)=O
: