Target
5-hydroxytryptamine receptor 2C
Ligand
BDBM50084959
Substrate
Ki
630.95±n/a nM
Comments
PDSP_1675
Citation
 Selkirk, JVScott, CHo, MBurton, MJWatson, JGaster, LMCollin, LJones, BJMiddlemiss, DNPrice, GW SB-224289--a novel selective (human) 5-HT1B receptor antagonist with negative intrinsic activity. Br J Pharmacol 125:202-8 (1998)  
Target
Name:
5-hydroxytryptamine receptor 2C
Synonyms:
5-HT-2C 5-HT2C-INI 5-HTR2C 5-hydroxytryptamine receptor 2C (5-HT-2C) 5HT-1C HTR1C Serotonin (5-HT3) receptor Serotonin Receptor 2C
Type:
G Protein-Coupled Receptor (GPCR)
Mol. Mass.:
51836.79
Organism:
Homo sapiens (Human)
Description:
P28335
Residue:
458
  
Inhibitor
Name:
BDBM50084959
Synonyms:
11'-Methyl-5-[[2'-methyl-4'-(5-methyl-1,2,4-oxadiazol-3-yl)biphenyl-4-yl]carbonyl]-2,3,6,7-tetrahydrospiro[furo-[2,3-f]indole-3,4'-piperidine](SB-224289) CHEMBL281350 [2'-Methyl-4'-(5-methyl-[1,2,4]oxadiazol-3-yl)-biphenyl-4-yl]-[3-(1-methyl-piperidine)-2,3,6,7-tetrahydro-1-oxa-5-aza-s-indacen-5-yl]-methanone
Type:
Small organic molecule
Emp. Form.:
C32H32N4O3
Mol. Mass.:
520.6215
SMILES:
CN1CCC2(COc3cc4CCN(C(=O)c5ccc(cc5)-c5ccc(cc5C)-c5noc(C)n5)c4cc23)CC1
: