Target
Metabotropic glutamate receptor 2
Ligand
BDBM50062500
Substrate
Ki
69±n/a nM
Comments
PDSP_3204
Citation
 Mutel, VAdam, GChaboz, SKemp, JAKlingelschmidt, AMesser, JWichmann, JWoltering, TRichards, JG Characterization of (2S,2'R,3'R)-2-(2',3'-[3H]-dicarboxycyclopropyl)glycine binding in rat brain. J Neurochem 71:2558-64 (1998)  
Target
Name:
Metabotropic glutamate receptor 2
Synonyms:
GPRC1B GRM2_HUMAN Metabotropic glutamate receptor mGlu2 | metabotropic glutamate 2
Type:
Enzyme
Mol. Mass.:
95584.88
Organism:
Homo sapiens (Human)
Description:
Q14416
Residue:
872
  
Inhibitor
Name:
BDBM50062500
Synonyms:
(S)-2-((R)-1-Amino-1-carboxy-ethyl)-cyclopropanecarboxylic acid MCCG | MCCG-I
Type:
Small organic molecule
Emp. Form.:
C7H11NO4
Mol. Mass.:
173.1665
SMILES:
C[C@@](N)(C1C[C@@H]1C(O)=O)C(O)=O
: