Target
Galanin receptor type 1
Ligand
BDBM85170
Substrate
Ki
1000±n/a nM
Comments
PDSP_862
Citation
 Borowsky, BWalker, MWHuang, LYJones, KASmith, KEBard, JBranchek, TAGerald, C Cloning and characterization of the human galanin GALR2 receptor. Peptides 19:1771-81 (1998)  
Target
Name:
Galanin receptor type 1
Synonyms:
GAL1-R GALNR1 GALR1_HUMAN Galanin receptor 1 | Galanin receptor type 1
Type:
Enzyme Catalytic Domain
Mol. Mass.:
38976.60
Organism:
Homo sapiens (Human)
Description:
Galanin R1 GALR1 HUMAN::P47211
Residue:
349
  
Inhibitor
Name:
BDBM85170
Synonyms:
Galanin (3-29), porcine
Type:
Small organic molecule
Emp. Form.:
C133H199N39O39
Mol. Mass.:
2968.2411
SMILES:
CCC(C)[C@H](NC(=O)[C@H](C)NC(=O)[C@H](Cc1cnc[nH]1)NC(=O)[C@@H]1CCCN1C(=O)CNC(=O)[C@H](CC(C)C)NC(=O)[C@H](CC(C)C)NC(=O)[C@H](Cc1ccc(O)cc1)NC(=O)CNC(=O)[C@H](C)NC(=O)[C@H](CO)NC(=O)[C@H](CC(N)=O)NC(=O)[C@H](CC(C)C)NC(=O)[C@@H](N)[C@@H](C)O)C(=O)NC(CC(O)=O)C(=O)N[C@@H](CC(N)=O)C(=O)N[C@@H](Cc1cnc[nH]1)C(=O)N[C@@H](CCCN=C(N)N)C(=O)N[C@@H](CO)C(=O)N[C@@H](Cc1ccccc1)C(=O)N[C@@H](Cc1cnc[nH]1)C(=O)N[C@@H](CC(O)=O)C(=O)N[C@@H](CCCCN)C(=O)N[C@@H](Cc1ccc(O)cc1)C(=O)NCC(=O)N[C@@H](CC(C)C)C(=O)N[C@@H](C)C(O)=O
: