Target
5-hydroxytryptamine receptor 2C
Ligand
BDBM50017721
Substrate
Ki
28±n/a nM
Comments
PDSP_606
Citation
 Herrick-Davis, KGrinde, EGauthier, CTeitler, M Pharmacological characterization of the constitutively activated state of the serotonin 5-HT2C receptor. Ann N Y Acad Sci 861:140-5 (1998)  
Target
Name:
5-hydroxytryptamine receptor 2C
Synonyms:
5-HT2C 5-hydroxytryptamine receptor 2C (5HT2c) 5ht1c Htr2c Serotonin receptor 2a and 2c (5HT2A and 5HT2C)
Type:
Enzyme
Mol. Mass.:
51935.10
Organism:
Rattus norvegicus (Rat)
Description:
P08909
Residue:
460
  
Inhibitor
Name:
BDBM50017721
Synonyms:
1-Methyl-4-(5H-dibenzo(a,d)cycloheptenylidene)piperidine 4-(5-dibenzo(a,d)cyclohepten-5-ylidine)-1-methylpiperidine 4-(5H-dibenzo[a,d][7]annulen-5-ylidene)-1-methylpiperidine4-(5H-dibenzo[a,d]cyclohepten-5-ylidene)-1-methylpiperidine CHEMBL516 | CYPROHEPTADINE
Type:
Small organic molecule
Emp. Form.:
C21H21N
Mol. Mass.:
287.3981
SMILES:
[#6]-[#7]-1-[#6]-[#6]\[#6](-[#6]-[#6]-1)=[#6]-1/c2ccccc2-[#6]=[#6]-c2ccccc-12
: