Target
5-hydroxytryptamine receptor 2B
Ligand
BDBM50014997
Substrate
Ki
30.3±n/a nM
Comments
PDSP_718
Citation
 Nelson, DLLucaites, VLWainscott, DBGlennon, RA Comparisons of hallucinogenic phenylisopropylamine binding affinities at cloned human 5-HT2A, -HT(2B) and 5-HT2C receptors. Naunyn Schmiedebergs Arch Pharmacol 359:1-6 (1999)  
Target
Name:
5-hydroxytryptamine receptor 2B
Synonyms:
5-HT-2B 5-hydroxytryptamine (serotonin) receptor 2B [Homo sapiens] 5-hydroxytryptamine receptor 2C (5HT2C) HTR2B Serotonin 2b (5-HT2b) receptor | Serotonin Receptor 2B
Type:
G Protein-Coupled Receptor (GPCR)
Mol. Mass.:
54312.47
Organism:
Homo sapiens (Human)
Description:
Receptor binding assays were performed using human clone stably expressed in CHO cells.
Residue:
481
  
Inhibitor
Name:
BDBM50014997
Synonyms:
1-(4-hexyl-2,5-dimethoxyphenyl)propan-2-amine CHEMBL268890 | DOHx
Type:
Small organic molecule
Emp. Form.:
C17H29NO2
Mol. Mass.:
279.4177
SMILES:
CCCCCCc1cc(OC)c(CC(C)N)cc1OC
: