Target
Kappa-type opioid receptor
Ligand
BDBM85393
Substrate
Ki
1.1±n/a nM
Comments
PDSP_463
Citation
 McLaughlin, JPHill, KPJiang, QSebastian, AArcher, SBidlack, JM Nitrocinnamoyl and chlorocinnamoyl derivatives of dihydrocodeinone: in vivo and in vitro characterization of mu-selective agonist and antagonist activity. J Pharmacol Exp Ther 289:304-11 (1999) Target
Name:
Kappa-type opioid receptor
Synonyms:
K-OR-1 OPIATE Kappa OPRK1 | OPRK_BOVIN
Type:
Enzyme Catalytic Domain
Mol. Mass.:
42629.84
Organism:
CALF
Description:
Q2KIP6
Residue:
380
  
Inhibitor
Name:
BDBM85393
Synonyms:
14β-(p-chlorocinnamoylamino)-7,8-dihydrocodeinon | CAM
Type:
Small organic molecule
Emp. Form.:
C27H27ClN2O4
Mol. Mass.:
478.967
SMILES:
COc1ccc2CC3N(C)CCC45[C@@H](Oc1c24)C(=O)CCC35NC(=O)\C=C/c1ccc(Cl)cc1
: