Target
Mu-type opioid receptor
Ligand
BDBM85396
Substrate
Ki
0.46±n/a nM
Comments
PDSP_462
Citation
 McLaughlin, JPHill, KPJiang, QSebastian, AArcher, SBidlack, JM Nitrocinnamoyl and chlorocinnamoyl derivatives of dihydrocodeinone: in vivo and in vitro characterization of mu-selective agonist and antagonist activity. J Pharmacol Exp Ther 289:304-11 (1999) Target
Name:
Mu-type opioid receptor
Synonyms:
MOR-1 OPIATE Mu OPRM_BOVIN
Type:
Enzyme Catalytic Domain
Mol. Mass.:
45038.37
Organism:
CALF
Description:
OPIATE Mu 2 0 CALF::P79350
Residue:
401
  
Inhibitor
Name:
BDBM85396
Synonyms:
CACO
Type:
Small organic molecule
Emp. Form.:
C27H27N3O6
Mol. Mass.:
489.5198
SMILES:
COc1ccc2CC3N(C)CCC45[C@@H](Oc1c24)C(=O)CCC35NC(=O)\C=C/c1ccc(cc1)[N+]([O-])=O
: