Target
Norepinephrine transporter
Ligand
BDBM85419
Substrate
Ki
5.45±n/a nM
Comments
PDSP_1627
Citation
 Damaj, MISlemmer, JECarroll, FIMartin, BR Pharmacological characterization of nicotine's interaction with cocaine and cocaine analogs. J Pharmacol Exp Ther 289:1229-36 (1999) Target
Name:
Norepinephrine transporter
Synonyms:
Type:
Enzyme Catalytic Domain
Mol. Mass.:
2082.45
Organism:
RAT
Description:
Norepinephrine transporter 0 RAT::Q9JIA2
Residue:
19
MLLARMKPQVQPELGGADQ
  
Inhibitor
Name:
BDBM85419
Synonyms:
RTI-110
Type:
Small organic molecule
Emp. Form.:
C15H18ClNO2
Mol. Mass.:
279.762
SMILES:
COC(=O)[C@@H]1[C@H]2CC[C@@H](C[C@@H]1c1ccc(Cl)cc1)N2
: