Target
Neprilysin
Ligand
BDBM85431
Substrate
Meas. Tech.
Enzyme Inhibition Assay
Temperature
298.15±0 K
IC50
2±0.0 nM
Citation
 Norcini, GMorazzoni, GPocchiari, FSantangelo, FSemeraro, C Novel selective thiol inhibitors of neutral endopeptidase containing heterocycles at P'2 position. J Enzym Inhib 12:155-60 (1997)  
Target
Name:
Neprilysin
Synonyms:
Mme Neprilysin Neutral endopeptidase 24.11
Type:
Protein
Mol. Mass.:
85789.59
Organism:
Rattus norvegicus (Rat)
Description:
P07861
Residue:
750
  
Inhibitor
Name:
BDBM85431
Synonyms:
NEP inhibitor, 6k
Type:
Small organic molecule
Emp. Form.:
C15H15NO3S2
Mol. Mass.:
321.415
SMILES:
OC(=O)c1cc(NC(=O)C(CS)Cc2ccccc2)cs1
: