Target
N(4)-(beta-N-acetylglucosaminyl)-L-asparaginase
Ligand
BDBM85473
Substrate
Meas. Tech.
Inhibition Assay
pH
5.8±0
Temperature
310.15±0 K
Ki
1400000±0 nM
Citation
 Risley, JMHuang, DHKaylor, JJMalik, JJXia, YQ Glycosylasparaginase inhibition studies: competitive inhibitors, transition state mimics, noncompetitive inhibitors. J Enzym Inhib 16:269-74 (2001)  
Target
Name:
N(4)-(beta-N-acetylglucosaminyl)-L-asparaginase
Synonyms:
AGA Glycosylasparaginase (GA) | N(4)-(beta-N-acetylglucosaminyl)-L-asparaginase
Type:
Enzyme
Mol. Mass.:
37206.38
Organism:
Homo sapiens (Human)
Description:
P20933
Residue:
346
  
Inhibitor
Name:
BDBM85473
Synonyms:
L-Cysteic acid, 8 | L-cysteic acid
Type:
Small organic molecule
Emp. Form.:
C3H7NO5S
Mol. Mass.:
169.156
SMILES:
NC(CS(O)(=O)=O)C(O)=O
: