Target
Bombesin receptor subtype-3
Ligand
BDBM85488
Substrate
Ki
8.9±n/a nM
Comments
PDSP_745
Citation
 Katsuno, TPradhan, TKRyan, RRMantey, SAHou, WDonohue, PJAkeson, MASpindel, ERBattey, JFCoy, DHJensen, RT Pharmacology and cell biology of the bombesin receptor subtype 4 (BB4-R). Biochemistry 38:7307-20 (1999)  
Target
Name:
Bombesin receptor subtype-3
Synonyms:
BRS-3 BRS3_HUMAN Bombesin like receptor 3
Type:
Enzyme Catalytic Domain
Mol. Mass.:
44424.45
Organism:
Homo sapiens (Human)
Description:
Bombesin 3 BRS3 HUMAN::P32247
Residue:
399
  
Inhibitor
Name:
BDBM85488
Synonyms:
DPhe6,BetaAla11,Phe13,Nle14-Bn(6-14)
Type:
Small organic molecule
Emp. Form.:
C57H76N14O10
Mol. Mass.:
1117.3011
SMILES:
CCCC[C@H](NC(=O)[C@H](Cc1ccccc1)NC(=O)[C@H](Cc1cnc[nH]1)NC(=O)[C@H](C)NC(=O)[C@@H](NC(=O)[C@H](C)NC(=O)[C@H](Cc1c[nH]c2ccccc12)NC(=O)[C@H](CCC(N)=O)NC(=O)[C@H](N)Cc1ccccc1)C(C)C)C(N)=O
: