Target
Bombesin
Ligand
BDBM85489
Substrate
Ki
2506±n/a nM
Comments
PDSP_744
Citation
 Katsuno, TPradhan, TKRyan, RRMantey, SAHou, WDonohue, PJAkeson, MASpindel, ERBattey, JFCoy, DHJensen, RT Pharmacology and cell biology of the bombesin receptor subtype 4 (BB4-R). Biochemistry 38:7307-20 (1999)  
Target
Name:
Bombesin
Synonyms:
BOMB_BOMVA | Bombesin 4
Type:
Enzyme Catalytic Domain
Mol. Mass.:
12340.04
Organism:
Frog
Description:
Bombesin 4 0 Frog::P84213
Residue:
107
  
Inhibitor
Name:
BDBM85489
Synonyms:
DPhe6,12,Leu14-Bn
Type:
Small organic molecule
Emp. Form.:
C80H117N21O17
Mol. Mass.:
1644.9155
SMILES:
CC(C)C[C@H](NC(=O)[C@H](CC(C)C)NC(=O)[C@H](Cc1ccccc1)NC(=O)CNC(=O)[C@@H](NC(=O)[C@H](C)NC(=O)[C@H](Cc1c[nH]c2ccccc12)NC(=O)[C@H](CCC(N)=O)NC(=O)[C@@H](Cc1ccccc1)NC(=O)CNC(=O)[C@H](CC(C)C)NC(=O)[C@H](CCCN=C(N)N)NC(=O)[C@H](CCC(N)=O)NC(=O)[C@@H]1CCC(=O)N1)C(C)C)C(N)=O
: