Target
Bombesin
Ligand
BDBM85488
Substrate
Ki
0.41±n/a nM
Comments
PDSP_745
Citation
 Katsuno, TPradhan, TKRyan, RRMantey, SAHou, WDonohue, PJAkeson, MASpindel, ERBattey, JFCoy, DHJensen, RT Pharmacology and cell biology of the bombesin receptor subtype 4 (BB4-R). Biochemistry 38:7307-20 (1999)  
Target
Name:
Bombesin
Synonyms:
BOMB_BOMVA | Bombesin 4
Type:
Enzyme Catalytic Domain
Mol. Mass.:
12340.04
Organism:
Frog
Description:
Bombesin 4 0 Frog::P84213
Residue:
107
  
Inhibitor
Name:
BDBM85488
Synonyms:
DPhe6,BetaAla11,Phe13,Nle14-Bn(6-14)
Type:
Small organic molecule
Emp. Form.:
C57H76N14O10
Mol. Mass.:
1117.3011
SMILES:
CCCC[C@H](NC(=O)[C@H](Cc1ccccc1)NC(=O)[C@H](Cc1cnc[nH]1)NC(=O)[C@H](C)NC(=O)[C@@H](NC(=O)[C@H](C)NC(=O)[C@H](Cc1c[nH]c2ccccc12)NC(=O)[C@H](CCC(N)=O)NC(=O)[C@H](N)Cc1ccccc1)C(C)C)C(N)=O
: