Target
Prostaglandin G/H synthase 2
Ligand
BDBM50027952
Substrate
Ki
96±n/a nM
Comments
PDSP_4467
Citation
 Warner, TDGiuliano, FVojnovic, IBukasa, AMitchell, JAVane, JR Nonsteroid drug selectivities for cyclo-oxygenase-1 rather than cyclo-oxygenase-2 are associated with human gastrointestinal toxicity: a full in vitro analysis. Proc Natl Acad Sci U S A 96:7563-8 (1999)  
Target
Name:
Prostaglandin G/H synthase 2
Synonyms:
COX2 Cyclooxygenase 2 (COX-2) Cyclooxygenase-2 (COX-2 AA) Cyclooxygenase-2 (COX-2) PGH2_HUMAN PHS II Prostaglandin E synthase/G/H synthase 2 Prostaglandin-endoperoxide synthase 2
Type:
Enzyme
Mol. Mass.:
69003.89
Organism:
Homo sapiens (Human)
Description:
Recombinant Cox-2 provided by Cayman (Cayman Chemical Co.,Ann Arbor, MI).
Residue:
604
  
Inhibitor
Name:
BDBM50027952
Synonyms:
5-(4-chlorobenzoyl)-1,4-dimethyl-1H-pyrrole-2-acetic acid Zomepirac | [5-(4-chlorobenzoyl)-1,4-dimethyl-1H-pyrrol-2-yl]acetic acid
Type:
Small organic molecule
Emp. Form.:
C15H14ClNO3
Mol. Mass.:
291.73
SMILES:
Cc1cc(CC(O)=O)n(C)c1C(=O)c1ccc(Cl)cc1
: