Target
Sodium-dependent serotonin transporter
Ligand
BDBM82437
Substrate
Ki
880±n/a nM
Comments
PDSP_1088
Citation
 Sánchez, CHyttel, J Comparison of the effects of antidepressants and their metabolites on reuptake of biogenic amines and on receptor binding. Cell Mol Neurobiol 19:467-89 (1999)  
Target
Name:
Sodium-dependent serotonin transporter
Synonyms:
5-HT Transporter 5HT transporter Anandamid membrane transporter, AMT Monoamine transporters; Norepinephrine & serotonin Slc6a4 Sodium-dependent serotonin transporter (SERT) | imipramine receptor
Type:
Multi-pass membrane protein
Mol. Mass.:
70168.43
Organism:
Rattus norvegicus (rat)
Description:
P31652
Residue:
630
  
Inhibitor
Name:
BDBM82437
Synonyms:
CAS_23047-25-8 NSC_3947 | US8629135, SW-06
Type:
Small organic molecule
Emp. Form.:
C26H27ClN2O
Mol. Mass.:
418.958
SMILES:
CN(CCCN1c2ccccc2CCc2ccccc12)CC(=O)c1ccc(Cl)cc1
: