Target
Prostaglandin E2 receptor EP3 subtype
Ligand
BDBM22369
Substrate
Ki
46±n/a nM
Comments
PDSP_4000
Citation
 Chan, CCBoyce, SBrideau, CCharleson, SCromlish, WEthier, DEvans, JFord-Hutchinson, AWForrest, MJGauthier, JYGordon, RGresser, MGuay, JKargman, SKennedy, BLeblanc, YLeger, SMancini, JO'Neill, GPOuellet, MPatrick, DPercival, MDPerrier, HPrasit, PRodger, I Rofecoxib [Vioxx, MK-0966; 4-(4'-methylsulfonylphenyl)-3-phenyl-2-(5H)-furanone]: a potent and orally active cyclooxygenase-2 inhibitor. Pharmacological and biochemical profiles. J Pharmacol Exp Ther 290:551-60 (1999) Target
Name:
Prostaglandin E2 receptor EP3 subtype
Synonyms:
PE2R3_RAT Prostaglandin E2 Prostanoid EP3 receptor | Ptger3
Type:
Enzyme Catalytic Domain
Mol. Mass.:
39958.37
Organism:
RAT
Description:
Prostaglandin E2 PTGER2 RAT::P34980
Residue:
365
  
Inhibitor
Name:
BDBM22369
Synonyms:
4-(4-methanesulfonylphenyl)-3-phenyl-2,5-dihydrofuran-2-one MK 0966 US11478464, Compound Rofecoxib | US11786535, Compound Rofecoxib
Type:
Small organic molecule
Emp. Form.:
C17H14O4S
Mol. Mass.:
314.356
SMILES:
CS(=O)(=O)c1ccc(cc1)C1=C(C(=O)OC1)c1ccccc1
: