Target
Somatostatin receptor type 5
Ligand
BDBM85080
Substrate
Ki
1000±n/a nM
Comments
PDSP_3367
Citation
 Patel, YC Somatostatin and its receptor family. Front Neuroendocrinol 20:157-98 (1999)  
Target
Name:
Somatostatin receptor type 5
Synonyms:
SOMATOSTATIN SST5 SS5-R SSR5_HUMAN Somatostatin receptor type 5 (SSTR5)
Type:
Enzyme
Mol. Mass.:
39218.02
Organism:
Homo sapiens (Human)
Description:
P35346
Residue:
364
  
Inhibitor
Name:
BDBM85080
Synonyms:
CH-275 L-Cys(1)-L-Lys-L-Phe-L-Phe-D-Trp-4-[(Isopropylamino)methyl]-L-Phe-L-Thr-L-Phe-L-Thr-L-Ser-L-Cys(1)-OH
Type:
Small organic molecule
Emp. Form.:
C74H96N14O15S2
Mol. Mass.:
1485.769
SMILES:
CC(C)NCc1ccc(C[C@H]2NC(=O)[C@H](Cc3c[nH]c4ccccc34)NC(=O)C(Cc3ccccc3)NC(=O)C(Cc3ccccc3)NC(=O)C(CCCCN)NC(=O)[C@H](N)CSSC[C@@H](NC(=O)[C@@H](CO)NC(=O)[C@@H](NC(=O)[C@@H](Cc3ccccc3)NC(=O)C(NC2=O)C(C)O)C(C)O)C(O)=O)cc1
: