Target
Gamma-aminobutyric acid receptor subunit alpha-1
Ligand
BDBM50026756
Substrate
Ki
0.81±n/a nM
Comments
PDSP_534
Citation
 Araujo, FRuano, DVitorica, J Native gamma-aminobutyric acid type A receptors from rat hippocampus, containing both alpha 1 and alpha 5 subunits, exhibit a single benzodiazepine binding site with alpha 5 pharmacological properties. J Pharmacol Exp Ther 290:989-97 (1999) Target
Name:
Gamma-aminobutyric acid receptor subunit alpha-1
Synonyms:
Benzodiazepine central GABA A Benzodiazepine GABA A Benzodiazepine Type II GABA A Benzodiazepine Type IIM GABA A Benzodiazepine omega2 GABA A alpha1 GABA receptor alpha-1 subunit GABA-PICROTOXIN Gabra-1 TBPS
Type:
Enzyme
Mol. Mass.:
51770.21
Organism:
Rattus norvegicus (Rat)
Description:
P62813
Residue:
455
  
Inhibitor
Name:
BDBM50026756
Synonyms:
3-Methyl-6-(3-trifluoromethyl-phenyl)-[1,2,4]triazolo[4,3-b]pyridazine CI-218872 CL218,872 | v3-Methyl-6-(3-trifluoromethyl-phenyl)-[1,2,4]triazolo[4,3-b]pyridazine
Type:
Small organic molecule
Emp. Form.:
C13H9F3N4
Mol. Mass.:
278.2326
SMILES:
Cc1nnc2ccc(nn12)-c1cccc(c1)C(F)(F)F
: